Target
Cytochrome P450 3A4
Ligand
BDBM50203653
Substrate
Meas. Tech.
ChEMBL_1625798 (CHEMBL3868267)
IC50
>50000±n/a nM
Citation
 Lombardo, MBender, KLondon, CPlotkin, MAKirkland, MMane, JPachanski, MGeissler, WCummings, JHabulihaz, BAkiyama, TEDi Salvo, JMadeira, MPols, JPowles, MAFinley, MFJohnson, ERoussel, TUebele, VNCrespo, ALeung, DAlleyne, CTrusca, DLei, YHoward, ADUjjainwalla, FTata, JRSinz, CJ Discovery of benzofuran propanoic acid GPR120 agonists: From uHTS hit to mechanism-based pharmacodynamic effects. Bioorg Med Chem Lett 26:5724-5728 (2016)  
Target
Name:
Cytochrome P450 3A4
Synonyms:
Albendazole monooxygenase CP3A4_HUMAN CYP3A4 CYPIIIA4 Cytochrome P450 3A4 (CYP3A4) Nifedipine oxidase Taurochenodeoxycholate 6-alpha-hydroxylase
Type:
Enzyme
Mol. Mass.:
57349.57
Organism:
Homo sapiens (Human)
Description:
Residue:
503
  
Inhibitor
Name:
BDBM50203653
Synonyms:
CHEMBL3896657
Type:
Small organic molecule
Emp. Form.:
C18H12F4O4
Mol. Mass.:
368.2791
SMILES:
OC(=O)CCc1cc2cc(ccc2o1)-c1cc(OC(F)(F)F)ccc1F
: