Target
Cytochrome P450 2D6
Ligand
BDBM50203652
Substrate
Meas. Tech.
ChEMBL_1625799 (CHEMBL3868268)
IC50
>50000±n/a nM
Citation
 Lombardo, MBender, KLondon, CPlotkin, MAKirkland, MMane, JPachanski, MGeissler, WCummings, JHabulihaz, BAkiyama, TEDi Salvo, JMadeira, MPols, JPowles, MAFinley, MFJohnson, ERoussel, TUebele, VNCrespo, ALeung, DAlleyne, CTrusca, DLei, YHoward, ADUjjainwalla, FTata, JRSinz, CJ Discovery of benzofuran propanoic acid GPR120 agonists: From uHTS hit to mechanism-based pharmacodynamic effects. Bioorg Med Chem Lett 26:5724-5728 (2016)  
Target
Name:
Cytochrome P450 2D6
Synonyms:
CP2D6_HUMAN CYP2DL1 Cytochrome P450 2D6 (CYP2D6) P450-DB1
Type:
Protein
Mol. Mass.:
55774.82
Organism:
Homo sapiens (Human)
Description:
P10635
Residue:
497
  
Inhibitor
Name:
BDBM50203652
Synonyms:
CHEMBL3909872
Type:
Small organic molecule
Emp. Form.:
C19H18ClF3O4
Mol. Mass.:
402.792
SMILES:
Cc1cc(cc(C)c1OCCCC(O)=O)-c1cc(OC(F)(F)F)ccc1Cl
: