Target
Free fatty acid receptor 4
Ligand
BDBM50203658
Substrate
Meas. Tech.
ChEMBL_1625789 (CHEMBL3868258)
EC50
20±n/a nM
Citation
 Lombardo, MBender, KLondon, CPlotkin, MAKirkland, MMane, JPachanski, MGeissler, WCummings, JHabulihaz, BAkiyama, TEDi Salvo, JMadeira, MPols, JPowles, MAFinley, MFJohnson, ERoussel, TUebele, VNCrespo, ALeung, DAlleyne, CTrusca, DLei, YHoward, ADUjjainwalla, FTata, JRSinz, CJ Discovery of benzofuran propanoic acid GPR120 agonists: From uHTS hit to mechanism-based pharmacodynamic effects. Bioorg Med Chem Lett 26:5724-5728 (2016)  
Target
Name:
Free fatty acid receptor 4
Synonyms:
FFAR4 G-protein coupled receptor 120 G-protein coupled receptor GT01 GPR120 O3FAR1 PGR4
Type:
PROTEIN
Mol. Mass.:
42256.91
Organism:
Homo sapiens (Human)
Description:
ChEMBL_1508994
Residue:
377
  
Inhibitor
Name:
BDBM50203658
Synonyms:
CHEMBL3973101
Type:
Small organic molecule
Emp. Form.:
C17H12F6O4
Mol. Mass.:
394.2652
SMILES:
OC(=O)CCCOc1c(F)cc(cc1F)-c1cc(OC(F)(F)F)ccc1F
: