Target
Free fatty acid receptor 4
Ligand
BDBM50207060
Substrate
Meas. Tech.
ChEMBL_1629515 (CHEMBL3872141)
EC50
14±n/a nM
Citation
 Adams, GLVelazquez, FJayne, CShah, UMiao, SAshley, ERMadeira, MAkiyama, TEDi Salvo, JSuzuki, TWang, NTruong, QGilbert, EZhou, DVerras, AKirkland, MPachanski, MPowles, MYin, WUjjainwalla, FVenkatraman, SEdmondson, SD Discovery of Chromane Propionic Acid Analogues as Selective Agonists of GPR120 with ACS Med Chem Lett 8:96-101 (2017)  
Target
Name:
Free fatty acid receptor 4
Synonyms:
FFAR4 G-protein coupled receptor 120 G-protein coupled receptor GT01 GPR120 O3FAR1 PGR4
Type:
PROTEIN
Mol. Mass.:
42256.91
Organism:
Homo sapiens (Human)
Description:
ChEMBL_1508994
Residue:
377
  
Inhibitor
Name:
BDBM50207060
Synonyms:
CHEMBL3952043
Type:
Small organic molecule
Emp. Form.:
C23H26FNO6
Mol. Mass.:
431.454
SMILES:
CO[C@H]1C[C@@H](C1)Oc1cc(OC)c(F)c(n1)-c1ccc2O[C@@H](CCC(O)=O)CCc2c1
: