Target
Free fatty acid receptor 4
Ligand
BDBM50207061
Substrate
Meas. Tech.
ChEMBL_1629536 (CHEMBL3872162)
EC50
6.8±n/a nM
Citation
 Adams, GLVelazquez, FJayne, CShah, UMiao, SAshley, ERMadeira, MAkiyama, TEDi Salvo, JSuzuki, TWang, NTruong, QGilbert, EZhou, DVerras, AKirkland, MPachanski, MPowles, MYin, WUjjainwalla, FVenkatraman, SEdmondson, SD Discovery of Chromane Propionic Acid Analogues as Selective Agonists of GPR120 with ACS Med Chem Lett 8:96-101 (2017)  
Target
Name:
Free fatty acid receptor 4
Synonyms:
FFAR4_MOUSE Free fatty acid receptor 4 Gpr120 Omega-3 fatty acid receptor 1
Type:
PROTEIN
Mol. Mass.:
40828.60
Organism:
Mus musculus
Description:
ChEMBL_1454435
Residue:
361
  
Inhibitor
Name:
BDBM50207061
Synonyms:
CHEMBL3980898
Type:
Small organic molecule
Emp. Form.:
C22H23F2NO5
Mol. Mass.:
419.4185
SMILES:
CO[C@H]1C[C@@H](C1)Oc1cc(F)c(F)c(n1)-c1ccc2O[C@@H](CCC(O)=O)CCc2c1
: