Target
Free fatty acid receptor 4
Ligand
BDBM50207075
Substrate
Meas. Tech.
ChEMBL_1629516 (CHEMBL3872142)
EC50
7.8±n/a nM
Citation
 Adams, GLVelazquez, FJayne, CShah, UMiao, SAshley, ERMadeira, MAkiyama, TEDi Salvo, JSuzuki, TWang, NTruong, QGilbert, EZhou, DVerras, AKirkland, MPachanski, MPowles, MYin, WUjjainwalla, FVenkatraman, SEdmondson, SD Discovery of Chromane Propionic Acid Analogues as Selective Agonists of GPR120 with ACS Med Chem Lett 8:96-101 (2017)  
Target
Name:
Free fatty acid receptor 4
Synonyms:
FFAR4 G-protein coupled receptor 120 G-protein coupled receptor GT01 GPR120 O3FAR1 PGR4
Type:
PROTEIN
Mol. Mass.:
42256.91
Organism:
Homo sapiens (Human)
Description:
ChEMBL_1508994
Residue:
377
  
Inhibitor
Name:
BDBM50207075
Synonyms:
CHEMBL3898962
Type:
Small organic molecule
Emp. Form.:
C23H24FNO5
Mol. Mass.:
413.4388
SMILES:
[H][C@]1(C[C@@]1([H])[C@@]1([H])CCc2cc(ccc2O1)-c1nc(OC2CCC2)cc(OC)c1F)C(O)=O
: