Target
ATP-binding cassette sub-family C member 9/ATP-sensitive inward rectifier potassium channel 11
Ligand
BDBM50208312
Substrate
Meas. Tech.
ChEMBL_92522 (CHEMBL859322)
EC50
794±n/a nM
Citation
 Perez-Medrano, ABuckner, SACoghlan, MJGregg, RJGopalakrishnan, MKort, MELynch, JKScott, VESullivan, JPWhiteaker, KLCarroll, WA Design and synthesis of novel cyanoguanidine ATP-sensitive potassium channel openers for the treatment of overactive bladder. Bioorg Med Chem Lett 14:397-400 (2004)  
Target
Name:
ATP-binding cassette sub-family C member 9/ATP-sensitive inward rectifier potassium channel 11
Synonyms:
Potassium channel, inwardly rectifying, subfamily J, member 11/Sulfonylurea receptor 2 | Sulfonylurea receptor 2, Kir6.2
Type:
Mol. Mass.:
Description:
ASSAY_ID of EBI is 46128
Components:
This complex has 2 components.
Component 1
Name:
ATP-binding cassette sub-family C member 9
Synonyms:
ABCC9 ATP-binding cassette transporter sub-family C member 9 Sulfonylurea receptor 2 | Sulfonylurea receptor 2, Kir6.2
Type:
PROTEIN
Mol. Mass.:
174236.59
Organism:
Homo sapiens (Human)
Description:
ChEMBL_495672
Residue:
1549
  
Component 2
Name:
ATP-sensitive inward rectifier potassium channel 11
Synonyms:
ATP-sensitive inward rectifier potassium channel 11 Inward rectifier K(+) channel Kir6.2 KCNJ11 Potassium channel, inwardly rectifying, subfamily J, member 11 Sulfonylurea receptor 2, Kir6.2
Type:
Enzyme Catalytic Domain
Mol. Mass.:
43549.41
Organism:
Homo sapiens (Human)
Description:
Potassium channel (ATP modulatory) 0 0::Q14654
Residue:
390
  
Inhibitor
Name:
BDBM50208312
Synonyms:
CHEMBL421903
Type:
Small organic molecule
Emp. Form.:
C15H12Cl4N4OS
Mol. Mass.:
438.159
SMILES:
Clc1ccc(cc1)C(=O)NC(NC(=S)Nc1cccnc1)C(Cl)(Cl)Cl
: