Target
Cannabinoid receptor 1
Ligand
BDBM50233605
Substrate
Meas. Tech.
ChEMBL_1651006 (CHEMBL4000261)
Ki
0.700000±n/a nM
Citation
 Nikas, SPSharma, RParonis, CAKulkarni, SThakur, GAHurst, DWood, JTGifford, RSRajarshi, GLiu, YRaghav, JGGuo, JJJärbe, TUReggio, PHBergman, JMakriyannis, A Probing the carboxyester side chain in controlled deactivation (-)-d(8)-tetrahydrocannabinols. J Med Chem 58:665-81 (2015)  
Target
Name:
Cannabinoid receptor 1
Synonyms:
Brain-type cannabinoid receptor CB-R CNR1_RAT Cannabinoid receptor Cnr1 | Skr6
Type:
G Protein-Coupled Receptor (GPCR)
Mol. Mass.:
52856.55
Organism:
Rattus norvegicus (rat)
Description:
P20272
Residue:
473
  
Inhibitor
Name:
BDBM50233605
Synonyms:
CHEMBL3104362 | US10882838, Example 1.20
Type:
Small organic molecule
Emp. Form.:
C25H34O4
Mol. Mass.:
398.5351
SMILES:
[H][C@@]12CC(C)=CC[C@@]1([H])C(C)(C)Oc1cc(cc(O)c21)C1(CCC1)C(=O)OCCCC
: