Target
Aldehyde dehydrogenase, mitochondrial
Ligand
BDBM50236904
Substrate
Meas. Tech.
ChEMBL_1659722 (CHEMBL4009334)
IC50
2000±n/a nM
Citation
 Buchman, CDHurley, TD Inhibition of the Aldehyde Dehydrogenase 1/2 Family by Psoralen and Coumarin Derivatives. J Med Chem 60:2439-2455 (2017)  
Target
Name:
Aldehyde dehydrogenase, mitochondrial
Synonyms:
ALDH class 2 ALDH2 ALDHI Aldehyde dehydrogenase (ALDH2)
Type:
Enzyme
Mol. Mass.:
56382.67
Organism:
Homo sapiens (Human)
Description:
P05091
Residue:
517
  
Inhibitor
Name:
BDBM50236904
Synonyms:
CHEMBL1335126
Type:
Small organic molecule
Emp. Form.:
C22H25NO4
Mol. Mass.:
367.4382
SMILES:
Cc1oc2cc3oc(=O)c(CCC(=O)N4CCCCC4)c(C)c3cc2c1C
: