Target
Aldehyde dehydrogenase family 1 member A3
Ligand
BDBM50236906
Substrate
Meas. Tech.
ChEMBL_1659729 (CHEMBL4009341)
IC50
10000±n/a nM
Citation
 Buchman, CDHurley, TD Inhibition of the Aldehyde Dehydrogenase 1/2 Family by Psoralen and Coumarin Derivatives. J Med Chem 60:2439-2455 (2017)  
Target
Name:
Aldehyde dehydrogenase family 1 member A3
Synonyms:
AL1A3_HUMAN ALDH6 Aldehyde dehydrogenase family 1 member A3 RalDH3 | Retinaldehyde dehydrogenase 3
Type:
PROTEIN
Mol. Mass.:
56110.85
Organism:
Homo sapiens (Human)
Description:
ChEMBL_109700
Residue:
512
  
Inhibitor
Name:
BDBM50236906
Synonyms:
CHEMBL4072973
Type:
Small organic molecule
Emp. Form.:
C18H16O5S
Mol. Mass.:
344.382
SMILES:
Cc1c(Cc2ccccc2)c(=O)oc2cc(OS(C)(=O)=O)ccc12
: