Target
Acid ceramidase
Ligand
BDBM50238574
Substrate
Meas. Tech.
ChEMBL_1663372 (CHEMBL4013053)
IC50
2.1±n/a nM
Citation
 Ortega, JAArencibia, JMLa Sala, GBorgogno, MBauer, IBono, LBraccia, CArmirotti, AGirotto, SGanesan, ADe Vivo, M Pharmacophore Identification and Scaffold Exploration to Discover Novel, Potent, and Chemically Stable Inhibitors of Acid Ceramidase in Melanoma Cells. J Med Chem 60:5800-5815 (2017)  
Target
Name:
Acid ceramidase
Synonyms:
ASAH ASAH1_HUMAN Acid ceramidase (AC)
Type:
Enzyme
Mol. Mass.:
44662.65
Organism:
Homo sapiens (Human)
Description:
Q13510
Residue:
395
  
Inhibitor
Name:
BDBM50238574
Synonyms:
CHEMBL4092051
Type:
Small organic molecule
Emp. Form.:
C17H18N4O
Mol. Mass.:
294.351
SMILES:
O=C(NCCCCc1ccccc1)n1nnc2ccccc12
: