Target
Cannabinoid receptor 1
Ligand
BDBM86988
Substrate
Ki
216±n/a nM
Comments
PDSP_8474
Citation
 Alig, LAlsenz, JAndjelkovic, MBendels, SBénardeau, ABleicher, KBourson, ADavid-Pierson, PGuba, WHildbrand, SKube, DLübbers, TMayweg, AVNarquizian, RNeidhart, WNettekoven, MPlancher, JMRocha, CRogers-Evans, MRöver, SSchneider, GTaylor, SWaldmeier, P Benzodioxoles: novel cannabinoid-1 receptor inverse agonists for the treatment of obesity. J Med Chem 51:2115-27 (2008)  
Target
Name:
Cannabinoid receptor 1
Synonyms:
CANN6 CB-R CNR CNR1_HUMAN Cannabinoid receptor Cannabinoid receptor 1 (brain)
Type:
G Protein-Coupled Receptor (GPCR)
Mol. Mass.:
52868.96
Organism:
Homo sapiens (Human)
Description:
P21554
Residue:
472
  
Inhibitor
Name:
BDBM86988
Synonyms:
(6-chloro-2,2-diphenyl-benzo[1,3]dioxol-5-yl)-morpholin-4-yl-methanone NSC_22475064
Type:
Small organic molecule
Emp. Form.:
C24H20ClNO4
Mol. Mass.:
421.873
SMILES:
Clc1cc2OC(Oc2cc1C(=O)N1CCOCC1)(c1ccccc1)c1ccccc1
: