Target
Cannabinoid receptor 1
Ligand
BDBM87011
Substrate
Ki
46±n/a nM
Comments
PDSP_8481
Citation
 Alig, LAlsenz, JAndjelkovic, MBendels, SBénardeau, ABleicher, KBourson, ADavid-Pierson, PGuba, WHildbrand, SKube, DLübbers, TMayweg, AVNarquizian, RNeidhart, WNettekoven, MPlancher, JMRocha, CRogers-Evans, MRöver, SSchneider, GTaylor, SWaldmeier, P Benzodioxoles: novel cannabinoid-1 receptor inverse agonists for the treatment of obesity. J Med Chem 51:2115-27 (2008)  
Target
Name:
Cannabinoid receptor 1
Synonyms:
CANN6 CB-R CNR CNR1_HUMAN Cannabinoid receptor Cannabinoid receptor 1 (brain)
Type:
G Protein-Coupled Receptor (GPCR)
Mol. Mass.:
52868.96
Organism:
Homo sapiens (Human)
Description:
P21554
Residue:
472
  
Inhibitor
Name:
BDBM87011
Synonyms:
(S)-(2,2-bis(2,4-difluorophenyl)-6-fluorobenzo[d][1,3]dioxol-5-yl)(2-methoxypyrrolidin-1-yl)methanone NSC_44450433
Type:
Small organic molecule
Emp. Form.:
C25H18F5NO4
Mol. Mass.:
491.4067
SMILES:
COC1CCCN1C(=O)c1cc2OC(Oc2cc1F)(c1ccc(F)cc1F)c1ccc(F)cc1F
: