Target
Cannabinoid receptor 2
Ligand
BDBM87000
Substrate
Ki
>10000±n/a nM
Comments
PDSP_8470
Citation
 Alig, LAlsenz, JAndjelkovic, MBendels, SBénardeau, ABleicher, KBourson, ADavid-Pierson, PGuba, WHildbrand, SKube, DLübbers, TMayweg, AVNarquizian, RNeidhart, WNettekoven, MPlancher, JMRocha, CRogers-Evans, MRöver, SSchneider, GTaylor, SWaldmeier, P Benzodioxoles: novel cannabinoid-1 receptor inverse agonists for the treatment of obesity. J Med Chem 51:2115-27 (2008)  
Target
Name:
Cannabinoid receptor 2
Synonyms:
CANNABINOID CB2 CB2 CB2B CNR2_HUMAN Cannabinoid CB2 receptor Cannabinoid receptor 2 (CB2R) | hCB2
Type:
G Protein-Coupled Receptor (GPCR)
Mol. Mass.:
39690.94
Organism:
Homo sapiens (Human)
Description:
P34972
Residue:
360
  
Inhibitor
Name:
BDBM87000
Synonyms:
1-(2,2-diphenyl-benzo[1,3]dioxole-5-sulfonyl)-4-(4-fluoro-phenyl)-1,2,3,6-tetrahydro-pyridine NSC_10097960
Type:
Small organic molecule
Emp. Form.:
C30H24FNO4S
Mol. Mass.:
513.579
SMILES:
Fc1ccc(cc1)C1=CCN(CC1)S(=O)(=O)c1ccc2OC(Oc2c1)(c1ccccc1)c1ccccc1
: