Target
Steroid C26-monooxygenase
Ligand
BDBM31773
Substrate
Meas. Tech.
Binding Assay
Kd
4.6e+3± 2e+2 nM
Citation
 Driscoll, MDMcLean, KJLevy, CMast, NPikuleva, IALafite, PRigby, SELeys, DMunro, AW Structural and biochemical characterization of Mycobacterium tuberculosis CYP142: evidence for multiple cholesterol 27-hydroxylase activities in a human pathogen. J Biol Chem 285:38270-82 (2010)  
Target
Name:
Steroid C26-monooxygenase
Synonyms:
CP142_MYCTO Cytochrome P450 142 (CYP142) | cyp142
Type:
Enzyme
Mol. Mass.:
41422.72
Organism:
Mycobacterium tuberculosis
Description:
P9WPL4
Residue:
372
  
Inhibitor
Name:
BDBM31773
Synonyms:
ECONAZOLE Gyno-pevaryl cid_68589
Type:
Small organic molecule
Emp. Form.:
C18H15Cl3N2O
Mol. Mass.:
381.684
SMILES:
Clc1ccc(COC(Cn2ccnc2)c2ccc(Cl)cc2Cl)cc1
: