Target
Steroid C26-monooxygenase
Ligand
BDBM8610
Substrate
Meas. Tech.
Binding Assay
Kd
2.1e+4± 4e+3 nM
Citation
 Driscoll, MDMcLean, KJLevy, CMast, NPikuleva, IALafite, PRigby, SELeys, DMunro, AW Structural and biochemical characterization of Mycobacterium tuberculosis CYP142: evidence for multiple cholesterol 27-hydroxylase activities in a human pathogen. J Biol Chem 285:38270-82 (2010)  
Target
Name:
Steroid C26-monooxygenase
Synonyms:
CP142_MYCTO Cytochrome P450 142 (CYP142) | cyp142
Type:
Enzyme
Mol. Mass.:
41422.72
Organism:
Mycobacterium tuberculosis
Description:
P9WPL4
Residue:
372
  
Inhibitor
Name:
BDBM8610
Synonyms:
1-[4-(4-{[(2R,4S)-2-(2,4-dichlorophenyl)-2-(1H-imidazol-1-ylmethyl)-1,3-dioxolan-4-yl]methoxy}phenyl)piperazin-1-yl]ethan-1-one CHEMBL75 Ketoconazole US9138393, Ketoconozole | US9144538, Ketoconozole
Type:
Small organic molecule
Emp. Form.:
C26H28Cl2N4O4
Mol. Mass.:
531.431
SMILES:
[H][C@]1(COc2ccc(cc2)N2CCN(CC2)C(C)=O)CO[C@@](Cn2ccnc2)(O1)c1ccc(Cl)cc1Cl
: