Target
Steroid C26-monooxygenase
Ligand
BDBM24656
Substrate
Meas. Tech.
Binding Assay
Kd
2.16e+5± 5e+3 nM
Citation
 Driscoll, MDMcLean, KJLevy, CMast, NPikuleva, IALafite, PRigby, SELeys, DMunro, AW Structural and biochemical characterization of Mycobacterium tuberculosis CYP142: evidence for multiple cholesterol 27-hydroxylase activities in a human pathogen. J Biol Chem 285:38270-82 (2010)  
Target
Name:
Steroid C26-monooxygenase
Synonyms:
CP125_MYCTO Cytochrome P450 125 (CYP125) cyp125 | cyp125A1
Type:
Enzyme
Mol. Mass.:
48425.01
Organism:
Mycobacterium tuberculosis
Description:
P9WPP0
Residue:
433
  
Inhibitor
Name:
BDBM24656
Synonyms:
4-PIM 4-phenyl-1H-imidazole CHEMBL14145 US9144538, 4-Phenylimidazole
Type:
Small organic molecule
Emp. Form.:
C9H8N2
Mol. Mass.:
144.1732
SMILES:
c1nc(c[nH]1)-c1ccccc1
: