Target
DNA-(apurinic or apyrimidinic site) endonuclease
Ligand
BDBM92736
Substrate
Meas. Tech.
Molecular Beacon Assay
Ki
1.300e+4±n/a nM
Citation
 Srinivasan, AWang, LCline, CJXie, ZSobol, RWXie, XQGold, B Identification and characterization of human apurinic/apyrimidinic endonuclease-1 inhibitors. Biochemistry 51:6246-59 (2012)  
Target
Name:
DNA-(apurinic or apyrimidinic site) endonuclease
Synonyms:
APE APEX APEX1_HUMAN Apurinic-apyrimidinic endonuclease 1 (APE-1) DNA-(apurinic or apyrimidinic site) lyase REF1
Type:
Protein
Mol. Mass.:
35560.12
Organism:
Homo sapiens (Human)
Description:
P27695
Residue:
318
  
Inhibitor
Name:
BDBM92736
Synonyms:
NSC89640, 9
Type:
Small molecule
Emp. Form.:
C18H18N6O10
Mol. Mass.:
478.3697
SMILES:
OC(=O)C(CCCCNc1ccc(cc1[N+]([O-])=O)[N+]([O-])=O)Nc1ccc(cc1[N+]([O-])=O)[N+]([O-])=O
: