Target
DNA-(apurinic or apyrimidinic site) endonuclease
Ligand
BDBM92737
Substrate
Meas. Tech.
Molecular Beacon Assay
Ki
1.700e+4±n/a nM
Citation
 Srinivasan, AWang, LCline, CJXie, ZSobol, RWXie, XQGold, B Identification and characterization of human apurinic/apyrimidinic endonuclease-1 inhibitors. Biochemistry 51:6246-59 (2012)  
Target
Name:
DNA-(apurinic or apyrimidinic site) endonuclease
Synonyms:
APE APEX APEX1_HUMAN Apurinic-apyrimidinic endonuclease 1 (APE-1) DNA-(apurinic or apyrimidinic site) lyase REF1
Type:
Protein
Mol. Mass.:
35560.12
Organism:
Homo sapiens (Human)
Description:
P27695
Residue:
318
  
Inhibitor
Name:
BDBM92737
Synonyms:
NSC107215, 10
Type:
Small molecule
Emp. Form.:
C22H22N4O6
Mol. Mass.:
438.4333
SMILES:
[O-][N+](=O)c1ccc(\C=C\C(=O)NCCCCNC(=O)\C=C/c2ccc(cc2)[N+]([O-])=O)cc1
: