Target
Histone H1.0
Ligand
BDBM50130293
Substrate
Meas. Tech.
Binding Assay
Ki
28±0.0 nM
Citation
 Mates, SFienberg, AWennogle, L Methods and compositions for sleep disorders and other disorders US Patent  US8598119 Publication Date 12/3/2013 
Target
Name:
Histone H1.0
Synonyms:
H1-0 H1F0 Histone H1
Type:
Cell-surface receptors
Mol. Mass.:
20917.09
Organism:
Homo sapiens (Human)
Description:
P07305
Residue:
194
  
Inhibitor
Name:
BDBM50130293
Synonyms:
7-{4-[4-(2,3-dichlorophenyl)piperazin-1-yl]butoxy}-3,4-dihydroquinolin-2(1H)-one CHEMBL1112 US10752588, Compound Aripiprazole US9018213, aripprazole | US9156822, Aripiprazole
Type:
Small organic molecule
Emp. Form.:
C23H27Cl2N3O2
Mol. Mass.:
448.385
SMILES:
Clc1cccc(N2CCN(CCCCOc3ccc4CCC(=O)Nc4c3)CC2)c1Cl
: