Target
Histone H1.0
Ligand
BDBM50001884
Substrate
Meas. Tech.
Binding Assay
Ki
1±0.0 nM
Citation
 Mates, SFienberg, AWennogle, L Methods and compositions for sleep disorders and other disorders US Patent  US8598119 Publication Date 12/3/2013 
Target
Name:
Histone H1.0
Synonyms:
H1-0 H1F0 Histone H1
Type:
Cell-surface receptors
Mol. Mass.:
20917.09
Organism:
Homo sapiens (Human)
Description:
P07305
Residue:
194
  
Inhibitor
Name:
BDBM50001884
Synonyms:
2-[4-(4-Methyl-benzyl)-piperazin-1-yl]-1-(2-methyl-2,3-dihydro-indol-1-yl)-ethanone 3-chloro-6-(4-methyl-piperazin-1-yl)-5H-dibenzo[b,e][1,4]diazepine 8-Chloro-11-(4-methyl-piperazin-1-yl)-5H-dibenzo[b,e][1,4]diazepine( Clozepine ) 8-Chloro-11-(4-methyl-piperazin-1-yl)-5H-dibenzo[b,e][1,4]diazepine(Clopazine) 8-chloro-11-(4-methylpiperazin-1-yl)-5H-dibenzo[b,e][1,4]diazepine CHEMBL538973 CLOZAPINE, 8-CHLORO-11-(4-METHYL-PIPERAZIN-1-YL)-5H-DIBENZO[B,E][1,4]DIAZEPINE HF 1854 US10752588, Compound Clozapine | US11498896, Compound Clozapine
Type:
Small organic molecule
Emp. Form.:
C18H19ClN4
Mol. Mass.:
326.823
SMILES:
CN1CCN(CC1)C1=Nc2cc(Cl)ccc2Nc2ccccc12
: