Target
RNA-editing ligase 1, mitochondrial
Ligand
BDBM128185
Substrate
Meas. Tech.
Fluorescence-based biochemical high throughput dose response assay to identify inhibitors of Trypanosoma brucei RNA editing ligase 1 (TbREL1).
IC50
>96559±n/a nM
Citation
 PubChem, PC Fluorescence-based biochemical high throughput dose response assay to identify inhibitors of Trypanosoma brucei RNA editing ligase 1 (TbREL1). PubChem Bioassay (2014)[AID] 
Target
Name:
RNA-editing ligase 1, mitochondrial
Synonyms:
REL1 Trypanosoma brucei RNA editing ligase 1
Type:
Enzyme Catalytic Domain
Mol. Mass.:
52299.36
Organism:
Trypanosoma brucei brucei
Description:
gi_342179211
Residue:
469
  
Inhibitor
Name:
BDBM128185
Synonyms:
4-(3-fluorophenyl)-6-methyl-1-[2-(trifluoromethyl)benzyl]-2-[[4-(trifluoromethyl)benzyl]amino]-4H-pyrimidine-5-carboxylic acid methyl ester MLS003843362 cid_53316177 | methyl 4-(3-fluorophenyl)-6-methyl-1-[[2-(trifluoromethyl)phenyl]methyl]-2-[[4-(trifluoromethyl)phenyl]methylamino]-4H-pyrimidine-5-carboxylate
Type:
Small organic molecule
Emp. Form.:
C29H24F7N3O2
Mol. Mass.:
579.5086
SMILES:
COC(=O)C1=C(C)N(Cc2ccccc2C(F)(F)F)C(NCc2ccc(cc2)C(F)(F)F)=NC1c1cccc(F)c1
: