Target
Purine nucleoside phosphorylase
Ligand
BDBM50293064
Substrate
Meas. Tech.
Inhibition Assay
Temperature
298.15±n/a K
Kd
0.62±n/a nM
Comments
extracted
Citation
 Clinch, KEvans, GBFurneaux, RHGulab, SAKelly, PMSchramm, VLTyler, PCWoolhouse, AD Acyclic amine inhibitors of nucleoside phosphorylases and hydrolases US Patent  US8853224 Publication Date 10/7/2014 
Target
Name:
Purine nucleoside phosphorylase
Synonyms:
Inosine phosphorylase NP PNPH_HUMAN | Purine nucleoside phosphorylase (PNPase)
Type:
Enzyme
Mol. Mass.:
32119.53
Organism:
Homo sapiens (Human)
Description:
Residue:
289
  
Inhibitor
Name:
BDBM50293064
Synonyms:
7-({[1,3-Dihydroxy-2-(hydroxymethyl)propan-2-yl]amino}methyl)-3,5-dihydro-4H-pyrrolo[3,2-d]pyrimidin-4-one Immucillins, 10
Type:
Small organic molecule
Emp. Form.:
C11H16N4O4
Mol. Mass.:
268.2691
SMILES:
OCC(CO)(CO)NCc1c[nH]c2c1nc[nH]c2=O
: