Target
1-deoxy-D-xylulose 5-phosphate reductoisomerase
Ligand
BDBM50153713
Substrate
Meas. Tech.
DXR Inhibition Assay for Fosmidomycin
pH
7.5±n/a
IC50
42±n/a nM
Comments
extracted
Citation
 Tritsch, DZinglé, CRohmer, MGrosdemange-Billiard, C Flavonoids: true or promiscuous inhibitors of enzyme? The case of deoxyxylulose phosphate reductoisomerase. Bioorg Chem 59:140-4 (2015)  
Target
Name:
1-deoxy-D-xylulose 5-phosphate reductoisomerase
Synonyms:
1-Deoxy-D-xylulose 5-phosphate reductoisomerase (DXP) 1-deoxy-D-xylulose 5-phosphate reductoisomerase (DXR) DXP reductoisomerase dxr yaeM
Type:
Protein
Mol. Mass.:
43384.52
Organism:
Escherichia coli
Description:
P45568
Residue:
398
  
Inhibitor
Name:
BDBM50153713
Synonyms:
3-(N-hydroxyformamido)propylphosphonic acid CHEMBL203125 fosmidomycin
Type:
Small organic molecule
Emp. Form.:
C4H10NO5P
Mol. Mass.:
183.0997
SMILES:
ON(CCCP(O)(O)=O)C=O
: