Target
Histone deacetylase 8
Ligand
BDBM152729
Substrate
Meas. Tech.
HDAC8 Fluorimetric Assay
pH
8.2±n/a
IC50
1.9e+4± 2e+3 nM
Comments
extracted
Citation
 Decroos, CChristianson, DW Design, Synthesis, and Evaluation of Polyamine Deacetylase Inhibitors, and High-Resolution Crystal Structures of Their Complexes with Acetylpolyamine Amidohydrolase. Biochemistry 54:4692-703 (2015)  
Target
Name:
Histone deacetylase 8
Synonyms:
HD8 HDAC8_HUMAN Histone deacetylase 8 (HDAC-8) | Human HDAC8
Type:
Enzyme
Mol. Mass.:
41749.60
Organism:
Homo sapiens (Human)
Description:
Q9BY41
Residue:
377
  
Inhibitor
Name:
BDBM152729
Synonyms:
6-Amino-N-hydroxypentanamide (5)
Type:
Small organic molecule
Emp. Form.:
C6H15N2O2
Mol. Mass.:
147.195
SMILES:
[NH3+]CCCCCC(=O)NO
: