Target
Phospholipase D1
Ligand
BDBM87119
Substrate
Meas. Tech.
In vivo Deuterated 1-Butanol PLD Assay
IC50
3.7±0.2 nM
Citation
 Scott, SASpencer, CTO'Reilly, MCBrown, KALavieri, RRCho, CHJung, DILarock, RCBrown, HALindsley, CW Discovery of desketoraloxifene analogues as inhibitors of mammalian, Pseudomonas aeruginosa, and NAPE phospholipase D enzymes. ACS Chem Biol 10:421-32 (2015)  
Target
Name:
Phospholipase D1
Synonyms:
Choline phosphatase 1 PLD1 Phosphatidylcholine-hydrolyzing phospholipase D1 Phospholipase D1 Phospholipase D2 (PLD2) | hPLD1
Type:
Protein
Mol. Mass.:
124219.92
Organism:
Homo sapiens (Human)
Description:
Q13393
Residue:
1074
  
Inhibitor
Name:
BDBM87119
Synonyms:
(1R,2R)-N-[(1S)-2-[4-(5-bromo-2-keto-3H-benzimidazol-1-yl)piperidino]-1-methyl-ethyl]-2-phenyl-cyclopropanecarboxamide;2,2,2-trifluoroacetic acid (1R,2R)-N-[(2S)-1-[4-(5-bromo-2-oxo-3H-benzimidazol-1-yl)-1-piperidinyl]propan-2-yl]-2-phenyl-1-cyclopropanecarboxamide;2,2,2-trifluoroacetic acid VU0359595 (2) cid_53470193
Type:
Small organic molecule
Emp. Form.:
C25H29BrN4O2
Mol. Mass.:
497.427
SMILES:
C[C@@H](CN1CCC(CC1)n1c2ccc(Br)cc2[nH]c1=O)NC(=O)[C@@H]1C[C@H]1c1ccccc1
: