Target
Genome polyprotein
Ligand
BDBM288002
Substrate
Meas. Tech.
HCV Replicon Luciferase Assay
EC50
<100±n/a nM
Citation
 Wang, TYin, ZKadow, JF Benzofurans substituted with secondary benzamide as HCV inhibitors US Patent  US10087167 Publication Date 10/2/2018 
Target
Name:
Genome polyprotein
Synonyms:
Genome polyprotein Hepatitis C virus polyprotein RNA-dependent RNA polymerase (NS5B)
Type:
Protein
Mol. Mass.:
327266.82
Organism:
Hepatitis C virus (HCV)
Description:
P26664
Residue:
3011
  
Inhibitor
Name:
BDBM288002
Synonyms:
US10087167, Compound 4011
Type:
Small organic molecule
Emp. Form.:
C44H39F2N3O5S
Mol. Mass.:
759.859
SMILES:
[#6]-[#7]-[#6](=O)-c1c(oc2cc(-[#7](-[#6]-[#6]F)S([#6])(=O)=O)c(cc12)-c1cccc(c1)-[#6](=O)-[#7]-1-[#6]-[#6]\[#6](-[#6]-[#6]-1)=[#6](\c1ccccc1)-c1ccccc1)-c1ccc(F)cc1
: