Target
Beta-glucuronidase
Ligand
BDBM178136
Substrate
Meas. Tech.
β-Glucuronidase Inhibition Assay
IC50
1.286e+5± 2.1e+3 nM
Citation
 Taha, MIsmail, NHImran, SRashwan, HJamil, WAli, SKashif, SMRahim, FSalar, UKhan, KM Synthesis of 6-chloro-2-Aryl-1H-imidazo[4,5-b]pyridine derivatives: Antidiabetic, antioxidant, ß-glucuronidase inhibiton and their molecular docking studies. Bioorg Chem 65:48-56 (2016)  
Target
Name:
Beta-glucuronidase
Synonyms:
Beta-glucuronidase EMBL:AAI33416.1 Ensembl:ENSBTAP00000000941} | GUSB
Type:
Protein
Mol. Mass.:
74467.69
Organism:
Bos taurus (Bovine)
Description:
EC 3.2.1.31, bovine liver
Residue:
652
  
Inhibitor
Name:
BDBM178136
Synonyms:
2-(6-Chloro-1H-imidazo[4,5-b]pyridin-2-yl)-4-methoxyphenol (13)
Type:
Small organic molecule
Emp. Form.:
C13H10ClN3O2
Mol. Mass.:
275.69
SMILES:
COc1ccc(O)c(c1)-c1nc2ncc(Cl)cc2[nH]1
: