Target
Cytochrome P450 11B1, mitochondrial
Ligand
BDBM191903
Substrate
Meas. Tech.
Cellular Enzyme Assay
EC50
214±n/a nM
Citation
 Aebi, JAmrein, KHornsperger, BKuhn, BLiu, YMaerki, HPMartin, REMayweg, AVMohr, PTan, X Phenyl-tetrahydroisoquinoline derivatives US Patent  US9187429 Publication Date 11/17/2015 
Target
Name:
Cytochrome P450 11B1, mitochondrial
Synonyms:
C11B1_HUMAN CYPXIB1 Cytochrome P450 11B1 Cytochrome P450 11B1, mitochondrial | S11BH
Type:
Enzyme
Mol. Mass.:
57591.44
Organism:
Homo sapiens (Human)
Description:
P15538
Residue:
503
  
Inhibitor
Name:
BDBM191903
Synonyms:
US9187429, 36 US9187429, 38
Type:
Small organic molecule
Emp. Form.:
C18H18ClFN2O
Mol. Mass.:
332.8
SMILES:
CCC(=O)NC1CCCc2c1cncc2-c1ccc(Cl)c(F)c1
: