Target
Cytochrome P450 11B2, mitochondrial
Ligand
BDBM191903
Substrate
Meas. Tech.
Cellular Enzyme Assay
EC50
7±n/a nM
Citation
 Aebi, JAmrein, KHornsperger, BKuhn, BLiu, YMaerki, HPMartin, REMayweg, AVMohr, PTan, X Phenyl-tetrahydroisoquinoline derivatives US Patent  US9187429 Publication Date 11/17/2015 
Target
Name:
Cytochrome P450 11B2, mitochondrial
Synonyms:
Aldosterone Synthase (CYP11B2) Aldosterone-synthesizing enzyme CYP11B2 Cytochrome P450 11B2 Cytochrome P450 11B2, mitochondrial P-450C18 | Steroid 18-hydroxylase
Type:
Protein
Mol. Mass.:
57582.15
Organism:
Homo sapiens (Human)
Description:
P19099
Residue:
503
  
Inhibitor
Name:
BDBM191903
Synonyms:
US9187429, 36 US9187429, 38
Type:
Small organic molecule
Emp. Form.:
C18H18ClFN2O
Mol. Mass.:
332.8
SMILES:
CCC(=O)NC1CCCc2c1cncc2-c1ccc(Cl)c(F)c1
: