Target
CD63 antigen
Ligand
BDBM212271
Substrate
Meas. Tech.
High Throughput Syk Biochemical Assay
pH
7±n/a
IC50
80±n/a nM
Comments
extracted
Citation
 Blomgren, PACurrie, KSKropf, JELee, SHLo, JRMitchell, SASchmitt, ACXiong, JXu, JZhao, ZSwaminathan, S Substituted imidazo[1,2-a]pyrazines as Syk inhibitors US Patent  US9290505 Publication Date 3/22/2016 
Target
Name:
CD63 antigen
Synonyms:
CD63 CD_antigen: CD63 Granulophysin Limp1 Lysosome integral membrane protein 1 Melanoma-associated antigen ME491 Ocular melanoma-associated antigen Tetraspanin-30 | Tspan-30
Type:
Mol. Mass.:
25640.41
Organism:
Homo sapiens (Human)
Description:
Residue:
238
  
Inhibitor
Name:
BDBM212271
Synonyms:
6-(6-aminopyrazin-2-yl)-N-(4-(4-(oxetan-3-yl)piperazin-1-yl)phenyl)imidazo[1,2-a]pyrazin-8-amine US10828299, Example Ex.-2 US9290505, Ex.-2 US9931338, Ex.-2
Type:
Small organic molecule
Emp. Form.:
C23H25N9O
Mol. Mass.:
443.5043
SMILES:
Nc1cncc(n1)-c1cn2ccnc2c(Nc2ccc(cc2)N2CCN(CC2)C2COC2)n1
: