Target
Prostaglandin G/H synthase 1
Ligand
BDBM222086
Substrate
Meas. Tech.
In Vitro Cyclooxygenase (COX) Inhibition Assay
IC50
1.12e+4±n/a nM
Citation
 Alsayed, SSElshemy, HAAbdelgawad, MAAbdel-Latif, MSAbdellatif, KR Design, synthesis and biological screening of some novel celecoxib and etoricoxib analogs with promising COX-2 selectivity, anti-inflammatory activity and gastric safety profile. Bioorg Chem 70:173-183 (2017)  
Target
Name:
Prostaglandin G/H synthase 1
Synonyms:
COX1 Cyclooxygenase-1 (COX-1) PTGS1 | Prostaglandin G/H synthase (cyclooxygenase)
Type:
Protein
Mol. Mass.:
68868.60
Organism:
Ovis aries (Sheep)
Description:
Residue:
600
  
Inhibitor
Name:
BDBM222086
Synonyms:
6-(4-Isobutylphenyl)-2-oxo-4-(p-tolyl)-1,2-dihydropyridine-3-carbonitrile (4h)
Type:
Small organic molecule
Emp. Form.:
C23H22N2O
Mol. Mass.:
342.4336
SMILES:
CC(C)Cc1ccc(cc1)-c1cc(-c2ccc(C)cc2)c(C#N)c(=O)[nH]1
: