Target
Prostaglandin G/H synthase 1
Ligand
BDBM222087
Substrate
Meas. Tech.
In Vitro Cyclooxygenase (COX) Inhibition Assay
IC50
1.42e+4±n/a nM
Citation
 Alsayed, SSElshemy, HAAbdelgawad, MAAbdel-Latif, MSAbdellatif, KR Design, synthesis and biological screening of some novel celecoxib and etoricoxib analogs with promising COX-2 selectivity, anti-inflammatory activity and gastric safety profile. Bioorg Chem 70:173-183 (2017)  
Target
Name:
Prostaglandin G/H synthase 1
Synonyms:
COX1 Cyclooxygenase-1 (COX-1) PTGS1 | Prostaglandin G/H synthase (cyclooxygenase)
Type:
Protein
Mol. Mass.:
68868.60
Organism:
Ovis aries (Sheep)
Description:
Residue:
600
  
Inhibitor
Name:
BDBM222087
Synonyms:
4-(4-Chlorophenyl)-6-(4-isobutylphenyl)-2-oxo-1,2-dihydropyridine-3-carbonitrile (4i)
Type:
Small organic molecule
Emp. Form.:
C22H19ClN2O
Mol. Mass.:
362.852
SMILES:
CC(C)Cc1ccc(cc1)-c1cc(-c2ccc(Cl)cc2)c(C#N)c(=O)[nH]1
: