Target
Prostaglandin G/H synthase 2
Ligand
BDBM222081
Substrate
Meas. Tech.
In Vitro Cyclooxygenase (COX) Inhibition Assay
IC50
7.3e+3±n/a nM
Citation
 Alsayed, SSElshemy, HAAbdelgawad, MAAbdel-Latif, MSAbdellatif, KR Design, synthesis and biological screening of some novel celecoxib and etoricoxib analogs with promising COX-2 selectivity, anti-inflammatory activity and gastric safety profile. Bioorg Chem 70:173-183 (2017)  
Target
Name:
Prostaglandin G/H synthase 2
Synonyms:
COX2 Cyclooxygenase-2 (COX-2) PTGS2 Prostaglandin G/H synthase (cyclooxygenase)
Type:
Protein
Mol. Mass.:
68976.98
Organism:
Ovis aries (Sheep)
Description:
Residue:
603
  
Inhibitor
Name:
BDBM222081
Synonyms:
4-(4-chlorophenyl)-6-(4-nitrophenyl)-2-oxo-1,2-dihydropyridine-3-carbonitrile (4c)
Type:
Small organic molecule
Emp. Form.:
C18H10ClN3O3
Mol. Mass.:
351.743
SMILES:
[O-][N+](=O)c1ccc(cc1)-c1cc(-c2ccc(Cl)cc2)c(C#N)c(=O)[nH]1
: