Target
Prostaglandin G/H synthase 2
Ligand
BDBM222084
Substrate
Meas. Tech.
In Vitro Cyclooxygenase (COX) Inhibition Assay
IC50
8.7e+2±n/a nM
Citation
 Alsayed, SSElshemy, HAAbdelgawad, MAAbdel-Latif, MSAbdellatif, KR Design, synthesis and biological screening of some novel celecoxib and etoricoxib analogs with promising COX-2 selectivity, anti-inflammatory activity and gastric safety profile. Bioorg Chem 70:173-183 (2017)  
Target
Name:
Prostaglandin G/H synthase 2
Synonyms:
COX2 Cyclooxygenase-2 (COX-2) PTGS2 Prostaglandin G/H synthase (cyclooxygenase)
Type:
Protein
Mol. Mass.:
68976.98
Organism:
Ovis aries (Sheep)
Description:
Residue:
603
  
Inhibitor
Name:
BDBM222084
Synonyms:
6-(4-nitrophenyl)-2-oxo-4-(thiophen-2-yl)-1,2-dihydropyridine-3-carbonitrile (4f)
Type:
Small organic molecule
Emp. Form.:
C16H9N3O3S
Mol. Mass.:
323.326
SMILES:
[O-][N+](=O)c1ccc(cc1)-c1cc(-c2cccs2)c(C#N)c(=O)[nH]1
: