Target
Prostaglandin G/H synthase 2
Ligand
BDBM222088
Substrate
Meas. Tech.
In Vitro Cyclooxygenase (COX) Inhibition Assay
IC50
9.3e+2±n/a nM
Citation
 Alsayed, SSElshemy, HAAbdelgawad, MAAbdel-Latif, MSAbdellatif, KR Design, synthesis and biological screening of some novel celecoxib and etoricoxib analogs with promising COX-2 selectivity, anti-inflammatory activity and gastric safety profile. Bioorg Chem 70:173-183 (2017)  
Target
Name:
Prostaglandin G/H synthase 2
Synonyms:
COX2 Cyclooxygenase-2 (COX-2) PTGS2 Prostaglandin G/H synthase (cyclooxygenase)
Type:
Protein
Mol. Mass.:
68976.98
Organism:
Ovis aries (Sheep)
Description:
Residue:
603
  
Inhibitor
Name:
BDBM222088
Synonyms:
4-(4-Fluorophenyl)-6-(4-isobutylphenyl)-2-oxo-1,2-dihydropyridine-3-carbonitrile (4j)
Type:
Small organic molecule
Emp. Form.:
C22H19FN2O
Mol. Mass.:
346.3975
SMILES:
CC(C)Cc1ccc(cc1)-c1cc(-c2ccc(F)cc2)c(C#N)c(=O)[nH]1
: