Target
Lipoxygenase
Ligand
BDBM222269
Substrate
Meas. Tech.
Molecular Docking
Ki
868.14±0.0 nM
Citation
 Vinayagam, JGajbhiye, RLMandal, LArumugam, MAchari, AJaisankar, P Substituted furans as potent lipoxygenase inhibitors: Synthesis, in vitro and molecular docking studies. Bioorg Chem 71:97-101 (2017)  
Target
Name:
Lipoxygenase
Synonyms:
Lipoxygenase (SLO)
Type:
Protein
Mol. Mass.:
94406.69
Organism:
Glycine max (Soybean)
Description:
PDB 3PZW
Residue:
839
  
Inhibitor
Name:
BDBM222269
Synonyms:
2-Methyl-4-(2-oxo-2-phenyl-ethyl)-5-phenyl-furan-3-carboxylic acid ethyl ester (3b)
Type:
Small organic molecule
Emp. Form.:
C22H20O4
Mol. Mass.:
348.3918
SMILES:
CCOC(=O)c1c(C)oc(c1CC(=O)c1ccccc1)-c1ccccc1
: