Target
Lipoxygenase
Ligand
BDBM222273
Substrate
Meas. Tech.
Molecular Docking
Ki
140.54±0.0 nM
Citation
 Vinayagam, JGajbhiye, RLMandal, LArumugam, MAchari, AJaisankar, P Substituted furans as potent lipoxygenase inhibitors: Synthesis, in vitro and molecular docking studies. Bioorg Chem 71:97-101 (2017)  
Target
Name:
Lipoxygenase
Synonyms:
Lipoxygenase (SLO)
Type:
Protein
Mol. Mass.:
94406.69
Organism:
Glycine max (Soybean)
Description:
PDB 3PZW
Residue:
839
  
Inhibitor
Name:
BDBM222273
Synonyms:
5-(4-Bromo-phenyl)-4[2-(4-bromo-phenyl)-2-oxo-ethyl]-2-methyl-furan-3-carboxylic acid ethyl ester (3f)
Type:
Small organic molecule
Emp. Form.:
C22H18Br2O4
Mol. Mass.:
506.184
SMILES:
CCOC(=O)c1c(C)oc(c1CC(=O)c1ccc(Br)cc1)-c1ccc(Br)cc1
: