Target
Lipoxygenase
Ligand
BDBM222274
Substrate
Meas. Tech.
Molecular Docking
Ki
312.99±0.0 nM
Citation
 Vinayagam, JGajbhiye, RLMandal, LArumugam, MAchari, AJaisankar, P Substituted furans as potent lipoxygenase inhibitors: Synthesis, in vitro and molecular docking studies. Bioorg Chem 71:97-101 (2017)  
Target
Name:
Lipoxygenase
Synonyms:
Lipoxygenase (SLO)
Type:
Protein
Mol. Mass.:
94406.69
Organism:
Glycine max (Soybean)
Description:
PDB 3PZW
Residue:
839
  
Inhibitor
Name:
BDBM222274
Synonyms:
5-(4-Chloro-phenyl)-4[2-(4-chloro-phenyl)-2-oxo-ethyl]-2-methyl-furan-3-carboxylic acid methyl ester (3g)
Type:
Small organic molecule
Emp. Form.:
C21H16Cl2O4
Mol. Mass.:
403.255
SMILES:
COC(=O)c1c(C)oc(c1CC(=O)c1ccc(Cl)cc1)-c1ccc(Cl)cc1
: