Target
Genome polyprotein [1027-3010]
Ligand
BDBM243456
Substrate
Meas. Tech.
Replicon Assay
EC50
70±n/a nM
Citation
 Vendeville, SMRaboisson, PJLin, TTahri, AAmssoms, KI Macrocyclic indole derivatives useful as hepatitis C virus inhibitors US Patent  US9427440 Publication Date 8/30/2016 
Target
Name:
Genome polyprotein [1027-3010]
Synonyms:
POLG_HCVJ4 | Serine protease NS3/ RNA-directed RNA polymerase NS5B (NS3-NS5B)
Type:
Enzyme
Mol. Mass.:
214313.50
Organism:
Hepatitis C virus genotype 1b (strain HC-J4) (HCV)
Description:
aa 1027-3010
Residue:
1984
  
Inhibitor
Name:
BDBM243456
Synonyms:
US9427440, 1
Type:
Small organic molecule
Emp. Form.:
C32H38N4O6S
Mol. Mass.:
606.732
SMILES:
COc1ccc2-c3c(C4CCCCC4)c4ccc5cc4n3CC(=Cc2c1)C(=O)N(C)CCOCCN(C)S(=O)(=O)NC5=O
: