Target
Glutathione S-transferase P/Tyrosine-protein kinase JAK1
Ligand
BDBM257494
Substrate
Meas. Tech.
Biochemical HTRF Assay
Temperature
298.15±n/a K
IC50
2±n/a nM
Comments
extracted
Citation
 Brubaker, JClose, JTJung, JMartinez, MWhite, CWilson, KYoung, JRZhang, H Acyclic cyanoethylpyrazoles as janus kinase inhibitors US Patent  US9493441 Publication Date 11/15/2016 
Target
Name:
Glutathione S-transferase P/Tyrosine-protein kinase JAK1
Synonyms:
GST-JAK1
Type:
Protein
Mol. Mass.:
Description:
Components:
This complex has 2 components.
Component 1
Name:
Glutathione S-transferase P
Synonyms:
FAEES3 GST3 GSTP1-1 Glutathione S-transferase Glutathione S-transferase P Glutathione transferase (GST)
Type:
Enzyme
Mol. Mass.:
23353.53
Organism:
Homo sapiens (Human)
Description:
P09211
Residue:
210
  
Component 2
Name:
Tyrosine-protein kinase JAK1
Synonyms:
JAK-1 JAK1A JAK1_HUMAN Janus kinase 1 (JAK1) | Janus kinase 1 JAK1
Type:
Protein
Mol. Mass.:
133293.73
Organism:
Homo sapiens (Human)
Description:
P23458
Residue:
1154
  
Inhibitor
Name:
BDBM257494
Synonyms:
US9493441, 18-1
Type:
Small organic molecule
Emp. Form.:
C19H19N7O2
Mol. Mass.:
377.3999
SMILES:
Cc1noc(n1)-c1ccc(Nc2nn(cc2C(N)=O)[C@H](CC#N)C2CC2)cc1
: