Target
Glutaminyl-peptide cyclotransferase
Ligand
BDBM259900
Substrate
Meas. Tech.
Fluorometric Assays
pH
6±n/a
Temperature
303.15±n/a K
Ki
5.0304±n/a nM
Comments
extracted
Citation
 Heiser, UBuchholz, MSommer, RMeyer, ADemuth, H Inhibitors US Patent  US9512115 Publication Date 12/6/2016 
Target
Name:
Glutaminyl-peptide cyclotransferase
Synonyms:
Glutaminyl Cyclase Glutaminyl-peptide cyclotransferase Glutaminyl-tRNA cyclotransferase QPCT | QPCT_HUMAN
Type:
Enzyme
Mol. Mass.:
40877.05
Organism:
Homo sapiens (Human)
Description:
Q16769
Residue:
361
  
Inhibitor
Name:
BDBM259900
Synonyms:
US9512115, 3
Type:
Small organic molecule
Emp. Form.:
C20H18F3N3O3
Mol. Mass.:
405.3704
SMILES:
CC(F)(F)CCOc1ccc([C@H]2COC(=O)N2c2ccc3[nH]cnc3c2)c(F)c1
: