Target
Glutaminyl-peptide cyclotransferase
Ligand
BDBM259919
Substrate
Meas. Tech.
Fluorometric Assays
pH
6±n/a
Temperature
303.15±n/a K
Ki
5.1497±n/a nM
Comments
extracted
Citation
 Heiser, UBuchholz, MSommer, RMeyer, ADemuth, H Inhibitors US Patent  US9512115 Publication Date 12/6/2016 
Target
Name:
Glutaminyl-peptide cyclotransferase
Synonyms:
Glutaminyl Cyclase Glutaminyl-peptide cyclotransferase Glutaminyl-tRNA cyclotransferase QPCT | QPCT_HUMAN
Type:
Enzyme
Mol. Mass.:
40877.05
Organism:
Homo sapiens (Human)
Description:
Q16769
Residue:
361
  
Inhibitor
Name:
BDBM259919
Synonyms:
US9512115, 23
Type:
Small organic molecule
Emp. Form.:
C21H17F2N5O2
Mol. Mass.:
409.3888
SMILES:
FC1(F)CCN(C1)c1ccc([C@H]2COC(=O)N2c2ccc3[nH]cnc3c2)c(c1)C#N
: