Target
N-formyl peptide receptor 2
Ligand
BDBM350571
Substrate
Meas. Tech.
FLIPR
EC50
9.50±n/a nM
Citation
 Viswanath, VBeard, RLDonello, JEHsia, E Use of agonists of formyl peptide receptor 2 for treating dermatological diseases US Patent  US10434112 Publication Date 10/8/2019 
Target
Name:
N-formyl peptide receptor 2
Synonyms:
ALXR, FPRL1, FPR2 FPR2 FPRH1 Formyl Peptide Receptor-Like 1 LXA4 receptor Lipoxin A4 receptor RFP | hFPRL
Type:
G Protein-Coupled Receptor (GPCR)
Mol. Mass.:
38968.35
Organism:
Homo sapiens (Human)
Description:
P25090
Residue:
351
  
Inhibitor
Name:
BDBM350571
Synonyms:
1-{3-(5-chloropyridin-2-yl)-2- [2-(1H-imidazol-4-yl)ethyl]-1- oxo-1,2,3,4- tetrahydroisoquinolin-7-yl}-3- [4-(methylsulfonyl)phenyl]urea US10434112, Compound 33 | US10799518, Compound 33
Type:
Small organic molecule
Emp. Form.:
C27H25ClN6O4S
Mol. Mass.:
565.043
SMILES:
CS(=O)(=O)c1ccc(NC(=O)Nc2ccc3CC(N(CCc4c[nH]cn4)C(=O)c3c2)c2ccc(Cl)cn2)cc1
: