Target
N-formyl peptide receptor 2
Ligand
BDBM350655
Substrate
Meas. Tech.
FLIPR
EC50
0.270±n/a nM
Citation
 Viswanath, VBeard, RLDonello, JEHsia, E Use of agonists of formyl peptide receptor 2 for treating dermatological diseases US Patent  US10434112 Publication Date 10/8/2019 
Target
Name:
N-formyl peptide receptor 2
Synonyms:
ALXR, FPRL1, FPR2 FPR2 FPRH1 Formyl Peptide Receptor-Like 1 LXA4 receptor Lipoxin A4 receptor RFP | hFPRL
Type:
G Protein-Coupled Receptor (GPCR)
Mol. Mass.:
38968.35
Organism:
Homo sapiens (Human)
Description:
P25090
Residue:
351
  
Inhibitor
Name:
BDBM350655
Synonyms:
US10208071, Compound 117 US10799518, Compound 117 | diethyl ({[(2S)-2-{[(4- bromophenyl)carbamoyl]amino} pentanoyl]amino}methyl) phosphonate
Type:
Small organic molecule
Emp. Form.:
C17H27BrN3O5P
Mol. Mass.:
464.291
SMILES:
CCC[C@H](NC(=O)Nc1ccc(Br)cc1)C(=O)NCP(=O)(OCC)OCC
: