Target
Fibroblast growth factor receptor 4
Ligand
BDBM249418
Substrate
Meas. Tech.
Kinase Activity Inhibition Assay
IC50
<1.000±n/a nM
Citation
 Reynolds, DHao, MWang, JPrajapati, SSatoh, TSelvaraj, A Pyrimidine FGFR4 inhibitors US Patent  US10537571 Publication Date 1/21/2020 
Target
Name:
Fibroblast growth factor receptor 4
Synonyms:
CD_antigen: CD334 FGFR4 FGFR4 Fibroblast growth factor receptor JK2 TKF
Type:
Protein
Mol. Mass.:
87957.45
Organism:
Homo sapiens (Human)
Description:
P22455
Residue:
802
  
Inhibitor
Name:
BDBM249418
Synonyms:
US10537571, Compound 136 US9434697, 136 | US9730931, Compound 136
Type:
Small organic molecule
Emp. Form.:
C27H25Cl2N7O5
Mol. Mass.:
598.437
SMILES:
COc1cc(OC)c(Cl)c(NC(=O)N(Cc2cc(C)no2)c2cc(Nc3ccccc3NC(=O)C=C)ncn2)c1Cl
: