Target
Glycogen synthase kinase-3 beta
Ligand
BDBM385165
Substrate
Meas. Tech.
Z-lyte Assay
EC50
3.00±n/a nM
Citation
 KC, SKMittapalli, GKHofilena, BJMarakovits, JTChiruta, CMak, CCCao, J Isoquinolin-3-YL carboxamides and preparation and use thereof US Patent  US10556885 Publication Date 2/11/2020 
Target
Name:
Glycogen synthase kinase-3 beta
Synonyms:
GSK-3 beta GSK3B Glycogen synthase kinase 3 beta (GSK3B) Glycogen synthase kinase-3 beta (GSK-3B) Glycogen synthase kinase-3 beta (GSK3B) Glycogen synthase kinase-3beta (GSK3B) | Serine/threonine-protein kinase GSK3B
Type:
Enzyme
Mol. Mass.:
46756.38
Organism:
Homo sapiens (Human)
Description:
P49841
Residue:
420
  
Inhibitor
Name:
BDBM385165
Synonyms:
US10287267, Compound 325 US10556885, Compound 325 US11673881, Compound 325
Type:
Small organic molecule
Emp. Form.:
C22H20F3N5O2
Mol. Mass.:
443.4217
SMILES:
Cn1cc(cn1)-c1ccc2cnc(NC(=O)C3CC4(C3)CN(C4)C(=O)C(F)(F)F)cc2c1
: