Target
Glutaminyl-peptide cyclotransferase
Ligand
BDBM435111
Substrate
Meas. Tech.
QC Inhibition Assay
Ki
4.00±n/a nM
Citation
 Chen, CShih, CChen, CWang, HHuang, K Benzimidazole compounds and use thereof for treating Alzheimer's Disease or Huntington's Disease US Patent  US10584120 Publication Date 3/10/2020 
Target
Name:
Glutaminyl-peptide cyclotransferase
Synonyms:
Glutaminyl Cyclase Glutaminyl-peptide cyclotransferase Glutaminyl-tRNA cyclotransferase QPCT | QPCT_HUMAN
Type:
Enzyme
Mol. Mass.:
40877.05
Organism:
Homo sapiens (Human)
Description:
Q16769
Residue:
361
  
Inhibitor
Name:
BDBM435111
Synonyms:
US10584120, Compound 45
Type:
Small organic molecule
Emp. Form.:
C21H18N8O2
Mol. Mass.:
414.42
SMILES:
O=C1NC(=O)N(C1c1ccc(cc1)-c1nnn(CC2CC2)n1)c1ccc2[nH]cnc2c1
: