Target
Tyrosine-protein kinase JAK2 [831-1132]
Ligand
BDBM264217
Substrate
Meas. Tech.
Enzyme Inhibition Assay
IC50
1580±n/a nM
Citation
 Astrand, ABGrimster, NPKawatkar, SKettle, JGNilsson, MKRuston, LSu, QVasbinder, MWinter-Holt, JJWoessner, RDChuaqui, CEMcCabe, J Compounds and methods for inhibiting JAK US Patent  US10654835 Publication Date 5/19/2020 
Target
Name:
Tyrosine-protein kinase JAK2 [831-1132]
Synonyms:
JAK2 JAK2_HUMAN | Tyrosine-protein kinase JAK2 (aa 831-1132)
Type:
Enzyme Catalytic Domain
Mol. Mass.:
35337.99
Organism:
Homo sapiens (Human)
Description:
O60674[831-1132]
Residue:
302
  
Inhibitor
Name:
BDBM264217
Synonyms:
(2R)-N-(3-{5-bromo- 2-[(3-methoxy-1- methyl-1H-pyrazol-4- yl)amino]pyrimidin-4- yl}-1H-indol-7-yl)-2- (4-methylpiperazin-1- yl)propanamide US10654835, Example 37 US9714236, 37
Type:
Small organic molecule
Emp. Form.:
C25H30BrN9O2
Mol. Mass.:
568.469
SMILES:
COc1nn(C)cc1Nc1ncc(Br)c(n1)-c1c[nH]c2c(NC(=O)[C@@H](C)N3CCN(C)CC3)cccc12
: