Target
Tyrosine-protein kinase JAK2 [831-1132]
Ligand
BDBM264224
Substrate
Meas. Tech.
Enzyme Inhibition Assay
IC50
1950±n/a nM
Citation
 Astrand, ABGrimster, NPKawatkar, SKettle, JGNilsson, MKRuston, LSu, QVasbinder, MWinter-Holt, JJWoessner, RDChuaqui, CEMcCabe, J Compounds and methods for inhibiting JAK US Patent  US10654835 Publication Date 5/19/2020 
Target
Name:
Tyrosine-protein kinase JAK2 [831-1132]
Synonyms:
JAK2 JAK2_HUMAN | Tyrosine-protein kinase JAK2 (aa 831-1132)
Type:
Enzyme Catalytic Domain
Mol. Mass.:
35337.99
Organism:
Homo sapiens (Human)
Description:
O60674[831-1132]
Residue:
302
  
Inhibitor
Name:
BDBM264224
Synonyms:
(2R)-N-(3-{2-[(3- Methoxy-1-methyl- 1H-pyrazol-4-yl)amino]-5- methylpyrimidin-4-yl}- 1H-indol-7-yl)- 2-(4-methylpiperazin-1- yl)butanamide US10654835, Example 44 US9714236, 44
Type:
Small organic molecule
Emp. Form.:
C27H35N9O2
Mol. Mass.:
517.6259
SMILES:
CC[C@@H](N1CCN(C)CC1)C(=O)Nc1cccc2c(c[nH]c12)-c1nc(Nc2cn(C)nc2OC)ncc1C
: